Reaction Details
TargetProto-oncogene tyrosine-protein kinase Src
LigandBDBM150751
Substrate/Competitorn/a
Meas. Tech.DAPK1 Electrophoretic Mobility Shift Assay
pH7.5±n/a
Temperature298.15±n/a K
IC50 1.5e+2±n/a nM
Commentsextracted
Citation Wilbek, TSSkovgaard, TSorrell, FJKnapp, SBerthelsen, JStrømgaard, K Identification and characterization of a small-molecule inhibitor of death-associated protein kinase 1. Chembiochem16:59-63 (2015) 
 
Proto-oncogene tyrosine-protein kinase Src
Name:Proto-oncogene tyrosine-protein kinase Src
Type:Protein
Mol. Mass.:59838.60
Organism:Homo sapiens (Human)
Description:P12931
Residue:536
BDBM150751
NameBDBM150751
Synonyms:CPR005231 (6)
TypeSmall organic molecule
Emp. Form.C25H26N4O3
Mol. Mass.430.4989
SMILESCOc1cc(ccc1O)-c1ccc2ccc(-c3cccc(c3)C(=O)NCCN(C)C)n2n1