Reaction Details
TargetCytochrome P450 11B2, mitochondrial
LigandBDBM50206963
Substrate/Competitorn/a
Meas. Tech.Inhibition Assay
IC50 0.500±n/a nM
Citation Ali, ABennett, DJCai, JCarswell, ECooke, AHoyt, SBLo, MLondon, CMacLean, JPark, MKRatcliffe, PTaylor, JAWhitehead, BXiong, Y Imidazopyridyl compounds as aldosterone synthase inhibitors US Patent US9518055 Publication Date 12/13/2016
 
Cytochrome P450 11B2, mitochondrial
Name:Cytochrome P450 11B2, mitochondrial
Type:Protein
Mol. Mass.:57582.15
Organism:Homo sapiens (Human)
Description:P19099
Residue:503
BDBM50206963
NameBDBM50206963
Synonyms:CHEMBL3948337 | US9518055, Example 41
TypeSmall organic molecule
Emp. Form.C19H14FN3
Mol. Mass.303.333
SMILESFc1ccc2nc(c(C3CC3)n2c1)-c1cncc2ccccc12