Reaction Details
TargetPeptidoglycan-N-acetylglucosamine deacetylase
LigandBDBM150810
Substrate/Competitorn/a
Meas. Tech.Fluorescamine Assay
pH7±n/a
Temperature298.15±n/a K
Ki 2.20e+5± 4.0e+4 nM
Commentsextracted
Citation Ariyakumaran, RPokrovskaya, VLittle, DJHowell, PLNitz, M Direct Staudinger-Phosphonite Reaction Provides Methylphosphonamidates as Inhibitors of CE4 De-N-acetylases. Chembiochem16:1350-6 (2015) 
 
Peptidoglycan-N-acetylglucosamine deacetylase
Name:Peptidoglycan-N-acetylglucosamine deacetylase
Type:Protein
Mol. Mass.:52665.99
Organism:Streptococcus pneumoniae (Firmicutes)
Description:Q8DP63
Residue:463
BDBM150810
NameBDBM150810
Synonyms:Sodium N-methylphosphate-1,6-di-O-benzyl-beta-D-glucosamine (15f)
TypeSmall organic molecule
Emp. Form.C21H27NNaO7P
Mol. Mass.459.4051
SMILES[Na+].CP([O-])(=O)N[C@H]1C(O)[C@H](O)C(COCc2ccccc2)O[C@H]1OCc1ccccc1