Reaction Details
TargetCytochrome P450 2C19
LigandBDBM151585
Substrate/Competitorn/a
Meas. Tech.Inhibition Assay
IC50 19000±n/a nM
Citation Hoekstra, WJSchotzinger, RJRafferty, SW Metalloenzyme inhibitor compounds US Patent US8987315 Publication Date 3/24/2015
 
Cytochrome P450 2C19
Name:Cytochrome P450 2C19
Type:Enzyme
Mol. Mass.:55935.47
Organism:Homo sapiens (Human)
Description:P33261
Residue:490
BDBM151585
NameBDBM151585
Synonyms:US11739089, Compound Ketoconazole US9180183, Ketoconazole US9394290, KTZ (ketoconazole) | US9963439, Ketoconazole
TypeSmall organic molecule
Emp. Form.C26H28Cl2N4O4
Mol. Mass.531.431
SMILESCC(=O)N1CCN(CC1)c1ccc(OCC2COC(Cn3ccnc3)(O2)c2ccc(Cl)cc2Cl)cc1