Reaction Details
TargetLysine-specific histone demethylase 1A
LigandBDBM151605
Substrate/Competitorn/a
Meas. Tech.Inhibitor Screening Assay
IC50 218±n/a nM
Citation Vankayalapati, HSorna, VWarner, SLStephens, BBearss, DJSharma, S Substituted (E)-N′-(1-phenylethylidene)benzohydrazide analogs as histone demethylase inhibitors US Patent US8987335 Publication Date 3/24/2015
 
Lysine-specific histone demethylase 1A
Name:Lysine-specific histone demethylase 1A
Type:Enzyme
Mol. Mass.:92901.01
Organism:Homo sapiens (Human)
Description:O60341
Residue:852
BDBM151605
NameBDBM151605
Synonyms:US8987335, 1 | US9555024, 1
TypeSmall organic molecule
Emp. Form.C14H12N2O3
Mol. Mass.256.2567
SMILESOc1ccc(cc1)C(=O)N\N=C\c1ccccc1O