Reaction Details
TargetLysine-specific histone demethylase 1A
LigandBDBM50445343
Substrate/Competitorn/a
Meas. Tech.Inhibitor Screening Assay
IC50 196±n/a nM
Citation Vankayalapati, HSorna, VWarner, SLStephens, BBearss, DJSharma, S Substituted (E)-N′-(1-phenylethylidene)benzohydrazide analogs as histone demethylase inhibitors US Patent US8987335 Publication Date 3/24/2015
 
Lysine-specific histone demethylase 1A
Name:Lysine-specific histone demethylase 1A
Type:Enzyme
Mol. Mass.:92901.01
Organism:Homo sapiens (Human)
Description:O60341
Residue:852
BDBM50445343
NameBDBM50445343
Synonyms:CHEMBL3104348 | US9555024, 4
TypeSmall organic molecule
Emp. Form.C14H11BrN2O2
Mol. Mass.319.153
SMILESOc1ccccc1\C=N\NC(=O)c1ccc(Br)cc1