Reaction Details
TargetLysine-specific histone demethylase 1A
LigandBDBM151617
Substrate/Competitorn/a
Meas. Tech.Inhibitor Screening Assay
IC50 13±n/a nM
Citation Vankayalapati, HSorna, VWarner, SLStephens, BBearss, DJSharma, S Substituted (E)-N′-(1-phenylethylidene)benzohydrazide analogs as histone demethylase inhibitors US Patent US8987335 Publication Date 3/24/2015
 
Lysine-specific histone demethylase 1A
Name:Lysine-specific histone demethylase 1A
Type:Enzyme
Mol. Mass.:92901.01
Organism:Homo sapiens (Human)
Description:O60341
Residue:852
BDBM151617
NameBDBM151617
Synonyms:US8987335, 18
TypeSmall organic molecule
Emp. Form.C17H18ClN3O4S
Mol. Mass.395.861
SMILESCN(C)S(=O)(=O)c1cccc(c1)C(=O)N\N=C(/C)c1cc(Cl)ccc1O