Reaction Details
TargetHeat shock protein HSP 90-alpha
LigandBDBM152285
Substrate/Competitorn/a
Meas. Tech.Biacore Assay
pH7.6±n/a
Kd 0.057±n/a nM
Commentsextracted
Citation Brasca, MGCasale, EFerguson, RPolucci, PZuccotto, F Resorcinol derivatives as HSP90 inhibitors US Patent US8993556 Publication Date 3/31/2015
 
Heat shock protein HSP 90-alpha
Name:Heat shock protein HSP 90-alpha
Type:Molecular Chaperone
Mol. Mass.:84623.45
Organism:Homo sapiens (Human)
Description:P07900
Residue:732
BDBM152285
NameBDBM152285
Synonyms:US8993556, N-[1-(4,4-Difluorocyclohexyl)piperidin-4-yl]-5-{2-[4-(dimethylamino)phenoxy]-4,6-dihydroxyphenyl}isoxazole-3-carboxamide
TypeSmall organic molecule
Emp. Form.C29H34F2N4O5
Mol. Mass.556.6009
SMILESCN(C)c1ccc(Oc2cc(O)cc(O)c2-c2cc(no2)C(=O)NC2CCN(CC2)C2CCC(F)(F)CC2)cc1