Reaction Details
TargetPoly [ADP-ribose] polymerase 1
LigandBDBM209853
Substrate/Competitorn/a
Meas. Tech.Enzyme Activity
Temperature298.15±n/a K
IC50 15.0±n/a nM
Commentsextracted
Citation Tang, PCLi, XLi, XChen, YWang, BZhu, Z Methods of using phthalazinone ketone derivatives US Patent US9566277 Publication Date 2/14/2017
 
Poly [ADP-ribose] polymerase 1
Name:Poly [ADP-ribose] polymerase 1
Type:n/a
Mol. Mass.:113114.22
Organism:Homo sapiens (Human)
Description:P09874
Residue:1014
BDBM209853
NameBDBM209853
Synonyms:US9273052, 1 | US9566277, 1
TypeSmall organic molecule
Emp. Form.C22H16F4N6O2
Mol. Mass.472.3951
SMILESFc1ccc(Cc2n[nH]c(=O)c3ccccc23)cc1C(=O)N1CCn2c(C1)nnc2C(F)(F)F