Reaction Details
TargetBeta-lactamase SHV-1
LigandBDBM50021954
Substrate/Competitorn/a
Meas. Tech.Steady-State Kinetics Assay
pH7.4±n/a
Ki 1.5e+3± 3e+2 nM
IC50 3.4e+3± 5e+2 nM
Commentsextracted
Citation Che, TRodkey, EABethel, CRShanmugam, SDing, ZPusztai-Carey, MNottingham, MChai, WBuynak, JDBonomo, RAvan den Akker, FCarey, PR Detecting a quasi-stable imine species on the reaction pathway of SHV-1 ß-lactamase and 6ß-(hydroxymethyl)penicillanic acid sulfone. Biochemistry54:734-43 (2015) 
 
Beta-lactamase SHV-1
Name:Beta-lactamase SHV-1
Type:Protein
Mol. Mass.:31226.68
Organism:Klebsiella pneumoniae (Enterobacteria)
Description:4R3B
Residue:286
BDBM50021954
NameBDBM50021954
Synonyms:(2S,5R)-3,3-Dimethyl-4,4,7-trioxo-4lambda*6*-thia-1-aza-bicyclo[3.2.0]heptane-2-carboxylic acid 3,3-Dimethyl-4,4,7-trioxo-4lambda*6*-thia-1-aza-bicyclo[3.2.0]heptane-2-carboxylic acid CHEMBL403 SULBACTAM US20230322715, Compound ALK-09 | US9120808, Sulbactam sodium salt
TypeSmall organic molecule
Emp. Form.C8H11NO5S
Mol. Mass.233.242
SMILESCC1(C)[C@@H](N2[C@@H](CC2=O)S1(=O)=O)C(O)=O