Reaction Details
TargetAcetyltransferase, GNAT family
LigandBDBM152708
Substrate/Competitorn/a
Meas. Tech.Eis Ban Inhibition Assay
pH8±n/a
IC50>2.00e+5±n/a nM
Commentsextracted
Citation Green, KDBiswas, TChang, CWu, RChen, WJanes, BKChalupska, DGornicki, PHanna, PCTsodikov, OVJoachimiak, AGarneau-Tsodikova, S Biochemical and structural analysis of an Eis family aminoglycoside acetyltransferase from bacillus anthracis. Biochemistry54:3197-206 (2015) 
 
Acetyltransferase, GNAT family
Name:Acetyltransferase, GNAT family
Synonyms:Eis_Ban acetyltransferase (Eis_Ban)
Type:Protein
Mol. Mass.:45469.21
Organism:Bacillus anthracis str. Sterne
Description:Q81P65
Residue:385
BDBM152708
NameBDBM152708
Synonyms:3-Chloro-N-[3-(diethylamino)propyl]-1-benzothiophene-2-carboxamide (3)
TypeSmall organic molecule
Emp. Form.C16H21ClN2OS
Mol. Mass.324.869
SMILESCCN(CC)CCCNC(=O)c1sc2ccccc2c1Cl