Reaction Details
TargetNeuraminidase
LigandBDBM5023
Substrate/CompetitorBDBM4702
Meas. Tech.Neuraminidase Inhibition Assay
pH6.5±n/a
Temperature310.15±n/a K
IC50<1±n/a nM
Citation Chand, PKotian, PLDehghani, AEl-Kattan, YLin, THHutchison, TLBabu, YSBantia, SElliott, AJMontgomery, JA Systematic structure-based design and stereoselective synthesis of novel multisubstituted cyclopentane derivatives with potent antiinfluenza activity. J Med Chem44:4379-92 (2001) 
 
Neuraminidase
Name:Neuraminidase
Type:Enzyme
Mol. Mass.:52000.86
Organism:Influenza A virus (A/Singapore/1/57(H2N2))
Description:Q6XUE4
Residue:469
BDBM5023
BDBM4702
NameBDBM5023
Synonyms:(-)-(1R,3R,4R)-3-[(1S)-1-(Acetylamino)-2-ethylbutyl]-4-{[amino(imino)methyl]amino}cyclopentanecarboxylic Acid Cyclopentane Derivative 50
TypeSmall organic molecule
Emp. Form.C15H28N4O3
Mol. Mass.312.4078
SMILES[H][C@](NC(C)=O)(C(CC)CC)[C@@H]1C[C@H](C[C@H]1N=C(N)N)C(O)=O