Reaction Details
TargetEpidermal growth factor receptor [1-973]
LigandBDBM152769
Substrate/Competitorn/a
Meas. Tech.In vitro EGFR TK Inhibition Assays
Temperature298.15±n/a K
IC50 85.8±6.41 nM
Commentsextracted
Citation Hu, MYe, WLi, JZhong, GHe, GXu, QZhang, Y Synthesis and evaluation of salicylanilide derivatives as potential epidermal growth factor receptor inhibitors. Chem Biol Drug Des85:280-9 (2015) 
 
Epidermal growth factor receptor [1-973]
Name:Epidermal growth factor receptor [1-973]
Type:Protein
Mol. Mass.:108055.41
Organism:Homo sapiens (Human)
Description:P00533[1-973]
Residue:973
BDBM152769
NameBDBM152769
Synonyms:4-(3-morpholinopropoxy)-N-(3-bromophenyl)-2-hydroxybenzamide (8a)
TypeSmall organic molecule
Emp. Form.C20H23BrN2O4
Mol. Mass.435.312
SMILESOc1cc(OCCCN2CCOCC2)ccc1C(=O)Nc1cccc(Br)c1