Reaction Details
TargetEpidermal growth factor receptor [1-973]
LigandBDBM152770
Substrate/Competitorn/a
Meas. Tech.In vitro EGFR TK Inhibition Assays
Temperature298.15±n/a K
IC50 195.8±8.76 nM
Commentsextracted
Citation Hu, MYe, WLi, JZhong, GHe, GXu, QZhang, Y Synthesis and evaluation of salicylanilide derivatives as potential epidermal growth factor receptor inhibitors. Chem Biol Drug Des85:280-9 (2015) 
 
Epidermal growth factor receptor [1-973]
Name:Epidermal growth factor receptor [1-973]
Type:Protein
Mol. Mass.:108055.41
Organism:Homo sapiens (Human)
Description:P00533[1-973]
Residue:973
BDBM152770
NameBDBM152770
Synonyms:4-(3-Morpholinopropoxy)-N-(3-chlorophenyl)-2-hydroxybenzamide (9a)
TypeSmall organic molecule
Emp. Form.C20H23ClN2O4
Mol. Mass.390.861
SMILESOc1cc(OCCCN2CCOCC2)ccc1C(=O)Nc1cccc(Cl)c1