Reaction Details
TargetEpidermal growth factor receptor [1-973]
LigandBDBM152771
Substrate/Competitorn/a
Meas. Tech.In vitro EGFR TK Inhibition Assays
Temperature298.15±n/a K
IC50 142.1±8.34 nM
Commentsextracted
Citation Hu, MYe, WLi, JZhong, GHe, GXu, QZhang, Y Synthesis and evaluation of salicylanilide derivatives as potential epidermal growth factor receptor inhibitors. Chem Biol Drug Des85:280-9 (2015) 
 
Epidermal growth factor receptor [1-973]
Name:Epidermal growth factor receptor [1-973]
Type:Protein
Mol. Mass.:108055.41
Organism:Homo sapiens (Human)
Description:P00533[1-973]
Residue:973
BDBM152771
NameBDBM152771
Synonyms:4-(3-Morpholinopropoxy)-N-(m-tolyl)-2-hydroxybenzamide (10a)
TypeSmall organic molecule
Emp. Form.C21H26N2O4
Mol. Mass.370.4421
SMILESCc1cccc(NC(=O)c2ccc(OCCCN3CCOCC3)cc2O)c1