Reaction Details
TargetEpidermal growth factor receptor [1-973]
LigandBDBM152772
Substrate/Competitorn/a
Meas. Tech.In vitro EGFR TK Inhibition Assays
Temperature298.15±n/a K
IC50 34.6±3.22 nM
Commentsextracted
Citation Hu, MYe, WLi, JZhong, GHe, GXu, QZhang, Y Synthesis and evaluation of salicylanilide derivatives as potential epidermal growth factor receptor inhibitors. Chem Biol Drug Des85:280-9 (2015) 
 
Epidermal growth factor receptor [1-973]
Name:Epidermal growth factor receptor [1-973]
Type:Protein
Mol. Mass.:108055.41
Organism:Homo sapiens (Human)
Description:P00533[1-973]
Residue:973
BDBM152772
NameBDBM152772
Synonyms:4-(3-Morpholinopropoxy)-N-(3-(trifluoromethyl)phenyl)-2-hydroxybenzamide (11a)
TypeSmall organic molecule
Emp. Form.C21H23F3N2O4
Mol. Mass.424.4135
SMILESOc1cc(OCCCN2CCOCC2)ccc1C(=O)Nc1cccc(c1)C(F)(F)F