Reaction Details
TargetEpidermal growth factor receptor [1-973]
LigandBDBM152774
Substrate/Competitorn/a
Meas. Tech.In vitro EGFR TK Inhibition Assays
Temperature298.15±n/a K
IC50 84.8±4.23 nM
Commentsextracted
Citation Hu, MYe, WLi, JZhong, GHe, GXu, QZhang, Y Synthesis and evaluation of salicylanilide derivatives as potential epidermal growth factor receptor inhibitors. Chem Biol Drug Des85:280-9 (2015) 
 
Epidermal growth factor receptor [1-973]
Name:Epidermal growth factor receptor [1-973]
Type:Protein
Mol. Mass.:108055.41
Organism:Homo sapiens (Human)
Description:P00533[1-973]
Residue:973
BDBM152774
NameBDBM152774
Synonyms:4-(3-Morpholinopropoxy)-N-(2-chloro-4-nitrophenyl)-2-hydroxybenzamide (13a)
TypeSmall organic molecule
Emp. Form.C20H22ClN3O6
Mol. Mass.435.858
SMILESOc1cc(OCCCN2CCOCC2)ccc1C(=O)Nc1ccc(cc1Cl)[N+]([O-])=O