Reaction Details
TargetEpidermal growth factor receptor [1-973]
LigandBDBM152778
Substrate/Competitorn/a
Meas. Tech.In vitro EGFR TK Inhibition Assays
Temperature298.15±n/a K
IC50 35.2±4.68 nM
Commentsextracted
Citation Hu, MYe, WLi, JZhong, GHe, GXu, QZhang, Y Synthesis and evaluation of salicylanilide derivatives as potential epidermal growth factor receptor inhibitors. Chem Biol Drug Des85:280-9 (2015) 
 
Epidermal growth factor receptor [1-973]
Name:Epidermal growth factor receptor [1-973]
Type:Protein
Mol. Mass.:108055.41
Organism:Homo sapiens (Human)
Description:P00533[1-973]
Residue:973
BDBM152778
NameBDBM152778
Synonyms:4-(3-(Piperidin-1-yl)propoxy)-N-(3-(trifluoromethyl)phenyl)-2-hydroxybenzamide (11b)
TypeSmall organic molecule
Emp. Form.C22H25F3N2O3
Mol. Mass.422.4407
SMILESOc1cc(OCCCN2CCCCC2)ccc1C(=O)Nc1cccc(c1)C(F)(F)F