Reaction Details
TargetEpidermal growth factor receptor [1-973]
LigandBDBM152780
Substrate/Competitorn/a
Meas. Tech.In vitro EGFR TK Inhibition Assays
Temperature298.15±n/a K
IC50 23.0±3.65 nM
Commentsextracted
Citation Hu, MYe, WLi, JZhong, GHe, GXu, QZhang, Y Synthesis and evaluation of salicylanilide derivatives as potential epidermal growth factor receptor inhibitors. Chem Biol Drug Des85:280-9 (2015) 
 
Epidermal growth factor receptor [1-973]
Name:Epidermal growth factor receptor [1-973]
Type:Protein
Mol. Mass.:108055.41
Organism:Homo sapiens (Human)
Description:P00533[1-973]
Residue:973
BDBM152780
NameBDBM152780
Synonyms:4-(3-(Piperidin-1-yl)propoxy)-N-(2-chloro-4-nitrophenyl)-2-hydroxybenzamide (13b)
TypeSmall organic molecule
Emp. Form.C21H24ClN3O5
Mol. Mass.433.885
SMILESOc1cc(OCCCN2CCCCC2)ccc1C(=O)Nc1ccc(cc1Cl)[N+]([O-])=O