Reaction Details
TargetTyrosine-protein kinase JAK3
LigandBDBM153195
Substrate/Competitorn/a
Meas. Tech.HTRF Assay
Temperature298.15±n/a K
IC50 0.22±n/a nM
Commentsextracted
Citation Ahearn, SPChristopher, MDinsmore, CJung, JPu, QRivkin, AScott, MEWitter, DJWoo, HCCash, B Pyrrolopyrimidines as janus kinase inhibitors US Patent US8993756 Publication Date 3/31/2015
 
Tyrosine-protein kinase JAK3
Name:Tyrosine-protein kinase JAK3
Type:Protein
Mol. Mass.:125111.08
Organism:Homo sapiens (Human)
Description:P52333
Residue:1124
BDBM153195
NameBDBM153195
Synonyms:US8993756, 5-6
TypeSmall organic molecule
Emp. Form.C18H15ClN4O3
Mol. Mass.370.79
SMILESCCOC(=O)c1c[nH]c2ncnc(-c3cccc(NC(=O)C(Cl)=C)c3)c12