Reaction Details
TargetAmine oxidase [flavin-containing] B
LigandBDBM50240772
Substrate/Competitorn/a
Meas. Tech.Fluorescent-Based (Inhibitor) Screening Assay
pH7.5±n/a
IC50 600±n/a nM
Commentsextracted
Citation Guibourt, NOrtega Munoz, ACastro-Palomino Laria, J Phenylcyclopropylamine derivatives and their medical use US Patent US8993808 Publication Date 3/31/2015
 
Amine oxidase [flavin-containing] B
Name:Amine oxidase [flavin-containing] B
Type:Protein
Mol. Mass.:58768.76
Organism:Homo sapiens (Human)
Description:P27338
Residue:520
BDBM50240772
NameBDBM50240772
Synonyms:(1R,2S)-(-)-2-phenylcyclopropylamine (tranylcypromine)2-Phenyl-cyclopropylamine CHEMBL1179 TRANYLCYPROMINE US10836743, Compound TCP US9180183, Tranylcypromine rel-Tranylcypromine
TypeSmall organic molecule
Emp. Form.C9H11N
Mol. Mass.133.1903
SMILESN[C@@H]1C[C@H]1c1ccccc1