Reaction Details
TargetCarboxylic ester hydrolase
LigandBDBM50359397
Substrate/Competitorn/a
Meas. Tech.Inhibition Assay
pH8±n/a
IC50 1100±n/a nM
Commentsextracted
Citation Samadi, AMarco Contelles, JLBolea Tomás, ILuque Garriga, FJUnzeta López, M Derivatives of propargylamine having neuroprotective capacity for the treatment of Alzheimer's and Parkinson's diseases US Patent US8999994 Publication Date 4/7/2015
 
Carboxylic ester hydrolase
Name:Carboxylic ester hydrolase
Type:Protein
Mol. Mass.:68842.83
Organism:Equus caballus (Horse)
Description:Q9N1N9
Residue:602
BDBM50359397
NameBDBM50359397
Synonyms:CHEMBL1929419 | US8999994, 4
TypeSmall organic molecule
Emp. Form.C27H33N3O
Mol. Mass.415.5704
SMILESCN(CC#C)Cc1cc2cc(OCC3CCN(Cc4ccccc4)CC3)ccc2n1C