Reaction Details
TargetCarboxylic ester hydrolase
LigandBDBM153655
Substrate/Competitorn/a
Meas. Tech.Inhibition Assay
pH8±n/a
IC50 990±n/a nM
Commentsextracted
Citation Samadi, AMarco Contelles, JLBolea Tomás, ILuque Garriga, FJUnzeta López, M Derivatives of propargylamine having neuroprotective capacity for the treatment of Alzheimer's and Parkinson's diseases US Patent US8999994 Publication Date 4/7/2015
 
Carboxylic ester hydrolase
Name:Carboxylic ester hydrolase
Type:Protein
Mol. Mass.:68842.83
Organism:Equus caballus (Horse)
Description:Q9N1N9
Residue:602
BDBM153655
NameBDBM153655
Synonyms:US8999994, 7
TypeSmall organic molecule
Emp. Form.C46H63ClN4O
Mol. Mass.723.472
SMILESClCCCCC1CCN(Cc2ccccc2)CC1.CN(CC#C)Cc1cc2cc(OCCCCC3CCN(Cc4ccccc4)CC3)ccc2n1C