Reaction Details
TargetCarboxylic ester hydrolase
LigandBDBM8961
Substrate/Competitorn/a
Meas. Tech.Inhibition Assay
pH8±n/a
IC50 5.2±n/a nM
Commentsextracted
Citation Samadi, AMarco Contelles, JLBolea Tomás, ILuque Garriga, FJUnzeta López, M Derivatives of propargylamine having neuroprotective capacity for the treatment of Alzheimer's and Parkinson's diseases US Patent US8999994 Publication Date 4/7/2015
 
Carboxylic ester hydrolase
Name:Carboxylic ester hydrolase
Type:Protein
Mol. Mass.:68842.83
Organism:Equus caballus (Horse)
Description:Q9N1N9
Residue:602
BDBM8961
NameBDBM8961
Synonyms:1,2,3,4-tetrahydro-9-acridinamine 9-THA CHEMBL1337960 Cognex Tracine cid_1935 | tacrine.HCl
TypeSmall organic molecule
Emp. Form.C13H14N2
Mol. Mass.198.2637
SMILESNc1c2CCCCc2nc2ccccc12