Reaction Details
TargetAmine oxidase [flavin-containing] A
LigandBDBM153655
Substrate/Competitorn/a
Meas. Tech.Inhibition Assay
pH7.4±n/a
Temperature310.15±n/a K
IC50 10500±n/a nM
Commentsextracted
Citation Samadi, AMarco Contelles, JLBolea Tomás, ILuque Garriga, FJUnzeta López, M Derivatives of propargylamine having neuroprotective capacity for the treatment of Alzheimer's and Parkinson's diseases US Patent US8999994 Publication Date 4/7/2015
 
Amine oxidase [flavin-containing] A
Name:Amine oxidase [flavin-containing] A
Type:Enzyme
Mol. Mass.:59515.21
Organism:Rattus norvegicus (rat)
Description:n/a
Residue:526
BDBM153655
NameBDBM153655
Synonyms:US8999994, 7
TypeSmall organic molecule
Emp. Form.C46H63ClN4O
Mol. Mass.723.472
SMILESClCCCCC1CCN(Cc2ccccc2)CC1.CN(CC#C)Cc1cc2cc(OCCCCC3CCN(Cc4ccccc4)CC3)ccc2n1C