Reaction Details
TargetThioredoxin reductase 1, cytoplasmic
LigandBDBM156238
Substrate/Competitorn/a
Meas. Tech.In vitro Assay
pH7.6±n/a
IC50 5900±n/a nM
Commentsextracted
Citation Ostaszewski, RKlossowski, SZiuzia, ISzokalska, ASwiech, MGolab, J Esters of (acyloxymethyl)acrylamide, a pharmaceutical composition containing them, and their use as inhibitors of the thioredoxin—thioredoxin reductase system US Patent US9018255 Publication Date 4/28/2015
 
Thioredoxin reductase 1, cytoplasmic
Name:Thioredoxin reductase 1, cytoplasmic
Type:Protein
Mol. Mass.:70761.78
Organism:Homo sapiens (Human)
Description:Q16881
Residue:648
BDBM156238
NameBDBM156238
Synonyms:US9018255, 8b
TypeSmall organic molecule
Emp. Form.C18H15Cl2NO3
Mol. Mass.364.223
SMILESClc1cccc(Cl)c1C(=O)OCC(=C)C(=O)NCc1ccccc1