Reaction Details
TargetAdenosine receptor A2a
LigandBDBM156371
Substrate/Competitorn/a
Meas. Tech.Binding Assay
Ki 1.5±n/a nM
Citation Jeong, LSKim, HOJacobson, KAChoe, SA Adenosine derivatives, method for the synthesis thereof, and the pharmaceutical compositions for the prevention and treatment of the inflammatory diseases containing the same as an active ingredient US Patent US9018371 Publication Date 4/28/2015
 
Adenosine receptor A2a
Name:Adenosine receptor A2a
Type:G Protein-Coupled Receptor (GPCR)
Mol. Mass.:44716.46
Organism:Homo sapiens (Human)
Description:P29274
Residue:412
BDBM156371
NameBDBM156371
Synonyms:US9018371, 12
TypeSmall organic molecule
Emp. Form.C16H16ClN5O2S
Mol. Mass.377.849
SMILESOC1CS[C@H]([C@H]1O)n1cnc2c(NCc3cccc(Cl)c3)ncnc12