Reaction Details
TargetAdenosine receptor A2a
LigandBDBM158416
Substrate/Competitorn/a
Meas. Tech.FRET-Based Binding Assay
Ki 171±n/a nM
Citation Schann, SMayer, S Adenosine receptor ligands and uses thereof US Patent US9029393 Publication Date 5/12/2015
 
Adenosine receptor A2a
Name:Adenosine receptor A2a
Type:G Protein-Coupled Receptor (GPCR)
Mol. Mass.:44716.46
Organism:Homo sapiens (Human)
Description:P29274
Residue:412
BDBM158416
NameBDBM158416
Synonyms:US9029393, 71
TypeSmall organic molecule
Emp. Form.C24H19N3O2
Mol. Mass.381.4266
SMILESO=C(N1CCCc2ccccc12)c1ccc(cc1)C(=O)c1cnc2ccccn12