Reaction Details
TargetAdenosine receptor A2a
LigandBDBM158418
Substrate/Competitorn/a
Meas. Tech.FRET-Based Binding Assay
Ki 177±n/a nM
Citation Schann, SMayer, S Adenosine receptor ligands and uses thereof US Patent US9029393 Publication Date 5/12/2015
 
Adenosine receptor A2a
Name:Adenosine receptor A2a
Type:G Protein-Coupled Receptor (GPCR)
Mol. Mass.:44716.46
Organism:Homo sapiens (Human)
Description:P29274
Residue:412
BDBM158418
NameBDBM158418
Synonyms:US9029393, 85
TypeSmall organic molecule
Emp. Form.C23H22F3N5O
Mol. Mass.441.4489
SMILESCn1nc(-c2cnc3ccc(cn23)C(F)(F)F)c2ccc(cc12)C(=O)N1CCCCCC1