Reaction Details
TargetAdenosine receptor A2a
LigandBDBM158419
Substrate/Competitorn/a
Meas. Tech.FRET-Based Binding Assay
Ki 3±n/a nM
Citation Schann, SMayer, S Adenosine receptor ligands and uses thereof US Patent US9029393 Publication Date 5/12/2015
 
Adenosine receptor A2a
Name:Adenosine receptor A2a
Type:G Protein-Coupled Receptor (GPCR)
Mol. Mass.:44716.46
Organism:Homo sapiens (Human)
Description:P29274
Residue:412
BDBM158419
NameBDBM158419
Synonyms:US9029393, 97
TypeSmall organic molecule
Emp. Form.C23H24FN5O
Mol. Mass.405.468
SMILESCn1nc(-c2cnc3ccc(F)cn23)c2ccc(cc12)C(=O)N1CCCCCCC1