Reaction Details
TargetSerine/threonine-protein kinase B-raf [V600E]
LigandBDBM158490
Substrate/Competitorn/a
Meas. Tech.ADP-Glo Kinase Assay
pH7.5±n/a
IC50>10000±n/a nM
Commentsextracted
Citation Hammock, BDHwang, SHWecksler, ATMorisseau, C Sorafenib derivatives as sEH inhibitors US Patent US9029401 Publication Date 5/12/2015
 
Serine/threonine-protein kinase B-raf [V600E]
Name:Serine/threonine-protein kinase B-raf [V600E]
Type:n/a
Mol. Mass.:84474.98
Organism:Homo sapiens (Human)
Description:P15056 V600E
Residue:766
BDBM158490
NameBDBM158490
Synonyms:US9029401, 2288
TypeSmall organic molecule
Emp. Form.C20H18ClF6N3O2
Mol. Mass.481.819
SMILESFC(F)(F)c1ccc(O[C@H]2CC[C@@H](CC2)NC(=O)Nc2ccc(Cl)c(c2)C(F)(F)F)nc1