Reaction Details
TargetVascular endothelial growth factor receptor 2
LigandBDBM287563
Substrate/Competitorn/a
Meas. Tech.VEGFR2 Kinase Assay
pH7.4±n/a
IC50 3.00±n/a nM
Commentsextracted
Citation Boral, SWang, SMalone, TCWurster, JShen, JRobinson, M Substituted nicotinamide derivatives as kinase inhibitors US Patent US9567324 Publication Date 2/14/2017
 
Vascular endothelial growth factor receptor 2
Name:Vascular endothelial growth factor receptor 2
Type:Receptor Tyrosine Kinase
Mol. Mass.:151510.97
Organism:Homo sapiens (Human)
Description:P35968
Residue:1356
BDBM287563
NameBDBM287563
Synonyms:US9567324, 3
TypeSmall organic molecule
Emp. Form.C26H24N4O5S
Mol. Mass.504.558
SMILESCC(=O)N1CCS(=O)(CC1)=NC(=O)c1cncc(c1)C#Cc1cccc(NC(=O)c2occc2C)c1