Reaction Details
TargetMethyl-CpG-binding domain protein 2
LigandBDBM158512
Substrate/Competitorn/a
Meas. Tech.Binding Assay
IC50 670±n/a nM
Citation Nelson, WGYegnasubramanian, SLin, XSpeed, TJReichert, Z Agents for reversing epigenetic silencing of genes US Patent US9034574 Publication Date 5/19/2015
 
Methyl-CpG-binding domain protein 2
Name:Methyl-CpG-binding domain protein 2
Type:Enzyme Catalytic Domain
Mol. Mass.:43278.74
Organism:Homo sapiens (Human)
Description:gi_21595776
Residue:411
BDBM158512
NameBDBM158512
Synonyms:US9034574, XXII
TypeSmall organic molecule
Emp. Form.C18H14N2OS
Mol. Mass.306.382
SMILESOc1ccc2ccccc2c1C1NN=C(S1)c1ccccc1