Reaction Details
TargetMitogen-activated protein kinase kinase kinase 14
LigandBDBM158724
Substrate/Competitorn/a
Meas. Tech.Inhibition Assay
pH7.2±n/a
Ki 0.5±n/a nM
Commentsextracted
Citation Staben, SCastanedo, GMontalbetti, CAFeng, J Tricyclic compounds and methods of use therefor US Patent US9034866 Publication Date 5/19/2015
 
Mitogen-activated protein kinase kinase kinase 14
Name:Mitogen-activated protein kinase kinase kinase 14
Type:Protein
Mol. Mass.:104059.50
Organism:Homo sapiens (Human)
Description:Q99558
Residue:947
BDBM158724
NameBDBM158724
Synonyms:US9034866, 199
TypeSmall organic molecule
Emp. Form.C23H19F3N4O3
Mol. Mass.456.4172
SMILESCc1cc(no1)[C@](C)(O)C#Cc1ccc2C3CC(C3)n3c(nc(C(N)=O)c3C(F)(F)F)-c2c1