Reaction Details
TargetMitogen-activated protein kinase kinase kinase 14
LigandBDBM158808
Substrate/Competitorn/a
Meas. Tech.Inhibition Assay
pH7.2±n/a
Ki 0.16±n/a nM
Commentsextracted
Citation Staben, SCastanedo, GMontalbetti, CAFeng, J Tricyclic compounds and methods of use therefor US Patent US9034866 Publication Date 5/19/2015
 
Mitogen-activated protein kinase kinase kinase 14
Name:Mitogen-activated protein kinase kinase kinase 14
Type:Protein
Mol. Mass.:104059.50
Organism:Homo sapiens (Human)
Description:Q99558
Residue:947
BDBM158808
NameBDBM158808
Synonyms:US9034866, 283
TypeSmall organic molecule
Emp. Form.C23H20FN5O2
Mol. Mass.417.4356
SMILESCn1c(nc-2c1C1CC(C1)c1cc(F)c(cc-21)C#C[C@@](C)(O)c1ncccn1)C(N)=O