Reaction Details
TargetMitogen-activated protein kinase kinase kinase 14
LigandBDBM158889
Substrate/Competitorn/a
Meas. Tech.Inhibition Assay
pH7.2±n/a
Ki 0.53±n/a nM
Commentsextracted
Citation Staben, SCastanedo, GMontalbetti, CAFeng, J Tricyclic compounds and methods of use therefor US Patent US9034866 Publication Date 5/19/2015
 
Mitogen-activated protein kinase kinase kinase 14
Name:Mitogen-activated protein kinase kinase kinase 14
Type:Protein
Mol. Mass.:104059.50
Organism:Homo sapiens (Human)
Description:Q99558
Residue:947
BDBM158889
NameBDBM158889
Synonyms:US9034866, 364
TypeSmall organic molecule
Emp. Form.C20H18FN3O2
Mol. Mass.351.3742
SMILESNC(=O)c1cn2C3CC(C3)c3cc(F)c(cc3-c2n1)C#CC1(O)CCC1