Reaction Details
TargetMitogen-activated protein kinase kinase kinase 14
LigandBDBM158904
Substrate/Competitorn/a
Meas. Tech.Inhibition Assay
pH7.2±n/a
Ki 0.2±n/a nM
Commentsextracted
Citation Staben, SCastanedo, GMontalbetti, CAFeng, J Tricyclic compounds and methods of use therefor US Patent US9034866 Publication Date 5/19/2015
 
Mitogen-activated protein kinase kinase kinase 14
Name:Mitogen-activated protein kinase kinase kinase 14
Type:Protein
Mol. Mass.:104059.50
Organism:Homo sapiens (Human)
Description:Q99558
Residue:947
BDBM158904
NameBDBM158904
Synonyms:US9034866, 379
TypeSmall organic molecule
Emp. Form.C27H26N6O3
Mol. Mass.482.5337
SMILESCc1cc(no1)[C@](C)(O)C#Cc1ccc2C3CC(C3)n3c(Cc4ccnn4C)c(nc3-c2c1)C(N)=O