Reaction Details
TargetMitogen-activated protein kinase kinase kinase 14
LigandBDBM159089
Substrate/Competitorn/a
Meas. Tech.Inhibition Assay
pH7.2±n/a
Ki 0.39±n/a nM
Commentsextracted
Citation Staben, SCastanedo, GMontalbetti, CAFeng, J Tricyclic compounds and methods of use therefor US Patent US9034866 Publication Date 5/19/2015
 
Mitogen-activated protein kinase kinase kinase 14
Name:Mitogen-activated protein kinase kinase kinase 14
Type:Protein
Mol. Mass.:104059.50
Organism:Homo sapiens (Human)
Description:Q99558
Residue:947
BDBM159089
NameBDBM159089
Synonyms:US9034866, 564
TypeSmall organic molecule
Emp. Form.C21H19F3N4O4
Mol. Mass.448.3952
SMILESC[C@H]1COc2ccc(cc2-n2nc(C(N)=O)c(c12)C(F)(F)F)C#C[C@]1(O)CCN(C)C1=O