Reaction Details
TargetGlutaminyl-peptide cyclotransferase
LigandBDBM159348
Substrate/Competitorn/a
Meas. Tech.Inhibition Assay
pH8±n/a
Temperature303.15±n/a K
Ki 11.6±n/a nM
IC50 92.3±n/a nM
Commentsextracted
Citation Buchholz, MHeiser, U Inhibitors of glutaminyl cyclase US Patent US9034907 Publication Date 5/19/2015
 
Glutaminyl-peptide cyclotransferase
Name:Glutaminyl-peptide cyclotransferase
Type:Enzyme
Mol. Mass.:40877.05
Organism:Homo sapiens (Human)
Description:Q16769
Residue:361
BDBM159348
NameBDBM159348
Synonyms:US9034907, 1
TypeSmall organic molecule
Emp. Form.C15H16N4OS
Mol. Mass.300.379
SMILESCc1cncn1CCCn1c(=S)[nH]c2ccccc2c1=O