Reaction Details
Target2-acylglycerol O-acyltransferase 2
LigandBDBM159636
Substrate/Competitorn/a
Meas. Tech.Inhibition Assay
IC50 24±n/a nM
Citation Busujima, TOi, TTanaka, HShirasaki, YIwakiri, KSato, NTokita, S Nitrogen-containing condensed heterocyclic compound US Patent US9035059 Publication Date 5/19/2015
 
2-acylglycerol O-acyltransferase 2
Name:2-acylglycerol O-acyltransferase 2
Type:Enzyme
Mol. Mass.:38210.80
Organism:Homo sapiens (Human)
Description:Q3SYC2
Residue:334
BDBM159636
NameBDBM159636
Synonyms:US9035059, 6-75
TypeSmall organic molecule
Emp. Form.C35H45FN2O3S
Mol. Mass.592.807
SMILESCC(C)(C)c1ccc(CCN2CCc3cc(ccc3C2)S(=O)(=O)Nc2ccc(CCCC3CCOCC3)cc2F)cc1