Reaction Details
Target2-acylglycerol O-acyltransferase 2
LigandBDBM159683
Substrate/Competitorn/a
Meas. Tech.Inhibition Assay
IC50 31±n/a nM
Citation Busujima, TOi, TTanaka, HShirasaki, YIwakiri, KSato, NTokita, S Nitrogen-containing condensed heterocyclic compound US Patent US9035059 Publication Date 5/19/2015
 
2-acylglycerol O-acyltransferase 2
Name:2-acylglycerol O-acyltransferase 2
Type:Enzyme
Mol. Mass.:38210.80
Organism:Homo sapiens (Human)
Description:Q3SYC2
Residue:334
BDBM159683
NameBDBM159683
Synonyms:US9035059, 10-7/10-8
TypeSmall organic molecule
Emp. Form.C35H47FN2O2S
Mol. Mass.578.823
SMILESCCCCCCCc1ccc(NS(=O)(=O)c2ccc3CN(CCc3c2)C(C)Cc2ccc(cc2)C(C)(C)C)c(F)c1