Reaction Details
Target2-acylglycerol O-acyltransferase 2
LigandBDBM159699
Substrate/Competitorn/a
Meas. Tech.Inhibition Assay
IC50 40±n/a nM
Citation Busujima, TOi, TTanaka, HShirasaki, YIwakiri, KSato, NTokita, S Nitrogen-containing condensed heterocyclic compound US Patent US9035059 Publication Date 5/19/2015
 
2-acylglycerol O-acyltransferase 2
Name:2-acylglycerol O-acyltransferase 2
Type:Enzyme
Mol. Mass.:38210.80
Organism:Homo sapiens (Human)
Description:Q3SYC2
Residue:334
BDBM159699
NameBDBM159699
Synonyms:US9035059, 17-1
TypeSmall organic molecule
Emp. Form.C34H45FN2O3S
Mol. Mass.580.796
SMILESCCCCCCCOc1ccc(NS(=O)(=O)c2ccc3CN(CCc4ccc(cc4)C(C)(C)C)CCc3c2)c(F)c1