Reaction Details
Target2-acylglycerol O-acyltransferase 2
LigandBDBM159725
Substrate/Competitorn/a
Meas. Tech.Inhibition Assay
IC50 2±n/a nM
Citation Busujima, TOi, TTanaka, HShirasaki, YIwakiri, KSato, NTokita, S Nitrogen-containing condensed heterocyclic compound US Patent US9035059 Publication Date 5/19/2015
 
2-acylglycerol O-acyltransferase 2
Name:2-acylglycerol O-acyltransferase 2
Type:Enzyme
Mol. Mass.:38210.80
Organism:Homo sapiens (Human)
Description:Q3SYC2
Residue:334
BDBM159725
NameBDBM159725
Synonyms:US9035059, 19-4
TypeSmall organic molecule
Emp. Form.C33H40FN3O4S
Mol. Mass.593.752
SMILESC\C=C/CCCCCOc1ccc(NS(=O)(=O)c2ccc3CN(Cc3c2)C(=O)Nc2ccc(cc2)C(C)(C)C)c(F)c1