Reaction Details
Target2-acylglycerol O-acyltransferase 2
LigandBDBM159680
Substrate/Competitorn/a
Meas. Tech.Inhibition Assay
Temperature298.15±n/a K
IC50 46±n/a nM
Commentsextracted
Citation Busujima, TOi, TTanaka, HShirasaki, YIwakiri, KSato, NTokita, S Nitrogen-containing condensed heterocyclic compound US Patent US9035059 Publication Date 5/19/2015
 
2-acylglycerol O-acyltransferase 2
Name:2-acylglycerol O-acyltransferase 2
Type:Enzyme
Mol. Mass.:38210.80
Organism:Homo sapiens (Human)
Description:Q3SYC2
Residue:334
BDBM159680
NameBDBM159680
Synonyms:US9035059, 9-24
TypeSmall organic molecule
Emp. Form.C31H35F4N3O2S
Mol. Mass.589.687
SMILESFc1cc(CCCC2CCCC2)ccc1NS(=O)(=O)c1ccc2CN(CCc3ccc(cn3)C(F)(F)F)CCc2c1