Reaction Details
Target2-acylglycerol O-acyltransferase 2
LigandBDBM159734
Substrate/Competitorn/a
Meas. Tech.Inhibition Assay
Temperature298.15±n/a K
IC50 29±n/a nM
Commentsextracted
Citation Busujima, TOi, TTanaka, HShirasaki, YIwakiri, KSato, NTokita, S Nitrogen-containing condensed heterocyclic compound US Patent US9035059 Publication Date 5/19/2015
 
2-acylglycerol O-acyltransferase 2
Name:2-acylglycerol O-acyltransferase 2
Type:Enzyme
Mol. Mass.:38210.80
Organism:Homo sapiens (Human)
Description:Q3SYC2
Residue:334
BDBM159734
NameBDBM159734
Synonyms:US9035059, 23-1 | US9035059, 24-1/24-2
TypeSmall organic molecule
Emp. Form.C34H44FN3O2S
Mol. Mass.577.795
SMILESCC(N1CCc2cc(ccc2C1)S(=O)(=O)Nc1ccc(CCCC2CCCC2)cc1F)c1ccc(nc1)C(C)(C)C