Reaction Details
Target2-acylglycerol O-acyltransferase 2
LigandBDBM159739
Substrate/Competitorn/a
Meas. Tech.Inhibition Assay
Temperature298.15±n/a K
IC50 42±n/a nM
Commentsextracted
Citation Busujima, TOi, TTanaka, HShirasaki, YIwakiri, KSato, NTokita, S Nitrogen-containing condensed heterocyclic compound US Patent US9035059 Publication Date 5/19/2015
 
2-acylglycerol O-acyltransferase 2
Name:2-acylglycerol O-acyltransferase 2
Type:Enzyme
Mol. Mass.:38210.80
Organism:Homo sapiens (Human)
Description:Q3SYC2
Residue:334
BDBM159739
NameBDBM159739
Synonyms:US9035059, 24-3/24-4
TypeSmall organic molecule
Emp. Form.C31H35F4N3O2S
Mol. Mass.589.687
SMILESCC(N1CCc2cc(ccc2C1)S(=O)(=O)Nc1ccc(CCCC2CCCC2)cc1F)c1ccc(nc1)C(F)(F)F