Reaction Details
TargetEstrogen receptor
LigandBDBM158504
Substrate/Competitorn/a
Meas. Tech.Inhibition Assay
pH7.5±n/a
Temperature298.15±n/a K
Ki 0.23±n/a nM
Commentsextracted
Citation Coelingh Bennink, HJBunschoten, EJHolinka, CF Method of treating human skin and a skin care composition for use in such a method US Patent US9040509 Publication Date 5/26/2015
 
Estrogen receptor
Name:Estrogen receptor
Type:Protein
Mol. Mass.:66230.44
Organism:Homo sapiens (Human)
Description:P03372
Residue:595
BDBM158504
NameBDBM158504
Synonyms:US9034854, EE US9561238, EE
TypeSmall organic molecule
Emp. Form.C20H24O2
Mol. Mass.296.4034
SMILESCC12CC[C@H]3[C@@H](CCc4cc(O)ccc34)[C@@H]1CC[C@@]2(O)C#C