Reaction Details
TargetActivin receptor type-1
LigandBDBM36355
Substrate/Competitorn/a
Meas. Tech.Kinase Assay
IC50 42.77±n/a nM
Citation Hong, CCHopkins, CRHatzopoulos, AKLindsley, CWHao, J Compounds and methods useful for directing stem cell differentiation US Patent US9040694 Publication Date 5/26/2015
 
Activin receptor type-1
Name:Activin receptor type-1
Type:n/a
Mol. Mass.:57158.32
Organism:Homo sapiens (Human)
Description:n/a
Residue:509
BDBM36355
NameBDBM36355
Synonyms:4-(2-(4-(3-(quinolin-4-yl)pyrazolo[1,5-a]pyrimidin-6-yl)phenoxy)ethyl)morpholine US9040694, 2
TypeSmall organic molecule
Emp. Form.C27H25N5O2
Mol. Mass.451.5197
SMILESC(CN1CCOCC1)Oc1ccc(cc1)-c1cnc2c(cnn2c1)-c1ccnc2ccccc12