Reaction Details
TargetActivin receptor type-1
LigandBDBM5410
Substrate/Competitorn/a
Meas. Tech.Kinase Assay
IC50 2570±n/a nM
Citation Hong, CCHopkins, CRHatzopoulos, AKLindsley, CWHao, J Compounds and methods useful for directing stem cell differentiation US Patent US9040694 Publication Date 5/26/2015
 
Activin receptor type-1
Name:Activin receptor type-1
Type:n/a
Mol. Mass.:57158.32
Organism:Homo sapiens (Human)
Description:n/a
Residue:509
BDBM5410
NameBDBM5410
Synonyms:4-(2-(4-(3-phenylpyrazolo[1,5- a]pyrimidin-6-yl)phenoxy)ethyl)morpholine US9040694, 4 | pyrazolo[1,5-a]pyrimidine 4b
TypeSmall organic molecule
Emp. Form.C24H24N4O2
Mol. Mass.400.473
SMILESC(CN1CCOCC1)Oc1ccc(cc1)-c1cnc2c(cnn2c1)-c1ccccc1