Reaction Details
TargetActivin receptor type-1
LigandBDBM160333
Substrate/Competitorn/a
Meas. Tech.Kinase Assay
IC50 40.72±n/a nM
Citation Hong, CCHopkins, CRHatzopoulos, AKLindsley, CWHao, J Compounds and methods useful for directing stem cell differentiation US Patent US9040694 Publication Date 5/26/2015
 
Activin receptor type-1
Name:Activin receptor type-1
Type:n/a
Mol. Mass.:57158.32
Organism:Homo sapiens (Human)
Description:n/a
Residue:509
BDBM160333
NameBDBM160333
Synonyms:US9040694, 5
TypeSmall organic molecule
Emp. Form.C22H21N5
Mol. Mass.355.4356
SMILESC1CN(CCN1)c1ccc(cc1)-c1cnc2c(cnn2c1)-c1ccccc1